Target
Tyrosine-protein phosphatase non-receptor type 22
Ligand
BDBM50031907
Substrate
Meas. Tech.
ChEMBL_1437898 (CHEMBL3384862)
Ki
17860±n/a nM
Citation
 Hou, XLi, RLi, KYu, XSun, JPFang, H Fast identification of novel lymphoid tyrosine phosphatase inhibitors using target-ligand interaction-based virtual screening. J Med Chem 57:9309-22 (2014)  
Target
Name:
Tyrosine-protein phosphatase non-receptor type 22
Synonyms:
3.1.3.48 LyP Lymphoid phosphatase (Lyp) PEST-domain phosphatase PTPN22 Tyrosine-protein phosphatase non-receptor type 22 (LYP) | tyrosine-protein phosphatase non-receptor type 22 isoform 1
Type:
Mol. Mass.:
91712.31
Organism:
Homo sapiens (Human)
Description:
Q9Y2R2
Residue:
807
  
Inhibitor
Name:
BDBM50031907
Synonyms:
CHEMBL2337245
Type:
Small organic molecule
Emp. Form.:
C38H30N4O4
Mol. Mass.:
606.6692
SMILES:
Cc1ccc(o1)-c1cc(C(=O)NCc2cccc(CNC(=O)c3cc(nc4ccccc34)-c3ccc(C)o3)c2)c2ccccc2n1
: