Target
Muscarinic acetylcholine receptor M1
Ligand
BDBM50313633
Substrate
Meas. Tech.
ChEMBL_1441013 (CHEMBL3376443)
EC50
830±n/a nM
Citation
 Han, CChatterjee, ANoetzel, MJPanarese, JDSmith, EChase, PHodder, PNiswender, CConn, PJLindsley, CWStauffer, SR Discovery and SAR of muscarinic receptor subtype 1 (M1) allosteric activators from a molecular libraries high throughput screen. Part 1: 2,5-dibenzyl-2H-pyrazolo[4,3-c]quinolin-3(5H)-ones as positive allosteric modulators. Bioorg Med Chem Lett 25:384-8 (2014)  
Target
Name:
Muscarinic acetylcholine receptor M1
Synonyms:
ACM1_HUMAN Cholinergic receptor, muscarinic 1 | Cholinergic, muscarinic M1
Type:
Protein
Mol. Mass.:
51442.54
Organism:
Homo sapiens (Human)
Description:
P11229
Residue:
460
  
Inhibitor
Name:
BDBM50313633
Synonyms:
1-(2-fluoro-4-(1-methyl-1H-pyrazol-4-yl)benzyl)indoline-2,3-dione VU0366369
Type:
Small organic molecule
Emp. Form.:
C19H14FN3O2
Mol. Mass.:
335.3318
SMILES:
Cn1cc(cn1)-c1ccc(CN2C(=O)C(=O)c3ccccc23)c(F)c1
: