Target
Non-receptor tyrosine-protein kinase TYK2
Ligand
BDBM50035846
Substrate
Meas. Tech.
ChEMBL_1441073 (CHEMBL3377595)
IC50
79±n/a nM
Citation
 Duan, JJLu, ZJiang, BYang, BVDoweyko, LMNirschl, DSHaque, LELin, SBrown, GHynes, JTokarski, JSSack, JSKhan, JLippy, JSZhang, RFPitt, SShen, GPitts, WJCarter, PHBarrish, JCNadler, SGSalter-Cid, LMMcKinnon, MFura, ASchieven, GLWrobleski, ST Discovery of pyrrolo[1,2-b]pyridazine-3-carboxamides as Janus kinase (JAK) inhibitors. Bioorg Med Chem Lett 24:5721-6 (2014)  
Target
Name:
Non-receptor tyrosine-protein kinase TYK2
Synonyms:
Non-receptor tyrosine-protein kinase TYK2 (TYK2) TYK2_HUMAN | Tyrosine-protein kinase TYK2
Type:
Protein
Mol. Mass.:
133666.03
Organism:
Homo sapiens (Human)
Description:
P29597
Residue:
1187
  
Inhibitor
Name:
BDBM50035846
Synonyms:
CHEMBL3359912
Type:
Small organic molecule
Emp. Form.:
C15H20N4O2
Mol. Mass.:
288.3449
SMILES:
CC1(C)[C@@H](O)CC[C@H]1Nc1c(cnn2cccc12)C(N)=O
: