Target
Nucleotide-binding oligomerization domain-containing protein 1
Ligand
BDBM62334
Substrate
Meas. Tech.
ChEMBL_1450778 (CHEMBL3363923)
IC50
7700±n/a nM
Citation
 Jakopin, ? Nucleotide-binding oligomerization domain (NOD) inhibitors: a rational approach toward inhibition of NOD signaling pathway. J Med Chem 57:6897-918 (2014)  
Target
Name:
Nucleotide-binding oligomerization domain-containing protein 1
Synonyms:
CARD4 NOD1_HUMAN | nucleotide-binding oligomerization domain containing 1
Type:
Enzyme Catalytic Domain
Mol. Mass.:
107699.03
Organism:
Homo sapiens (Human)
Description:
gi_5174617
Residue:
953
  
Inhibitor
Name:
BDBM62334
Synonyms:
1-[(4-chlorophenyl)methyl]-2-benzimidazolamine MLS-0425658.0001 cid_743900
Type:
Small organic molecule
Emp. Form.:
C14H12ClN3
Mol. Mass.:
257.718
SMILES:
Nc1nc2ccccc2n1Cc1ccc(Cl)cc1
: