Target
Growth hormone secretagogue receptor type 1
Ligand
BDBM50051783
Substrate
Meas. Tech.
ChEMBL_1452141 (CHEMBL3365087)
Ki
15±n/a nM
Citation
 Cameron, KOBhattacharya, SKLoomis, AK Small molecule ghrelin receptor inverse agonists and antagonists. J Med Chem 57:8671-91 (2014)  
Target
Name:
Growth hormone secretagogue receptor type 1
Synonyms:
GH-releasing peptide receptor GHS-R GHSR_HUMAN Ghrelin receptor | Ghrelin receptor 1a (GHS-R1a)
Type:
Receptor
Mol. Mass.:
41334.57
Organism:
Homo sapiens (Human)
Description:
Receptor binding studies use plasma membranes from LLC PK-1 cells transiently transfected with hGHSR1a.
Residue:
366
  
Inhibitor
Name:
BDBM50051783
Synonyms:
CHEMBL3358450
Type:
Small organic molecule
Emp. Form.:
C25H35N5O3S
Mol. Mass.:
485.642
SMILES:
CCN(CC)CCCS(=O)(=O)N[C@H](CCc1ccccc1)c1nc(n[nH]1)-c1ccc(OC)cc1
: