Target
Beta-2 adrenergic receptor
Ligand
BDBM50055263
Substrate
Meas. Tech.
ChEMBL_1449714 (CHEMBL3378137)
Ki
0.600000±n/a nM
Citation
 Arnold, NBeattie, DBradley, MBrearley, ABrown, LCharlton, SJFairhurst, RAFarr, DFozard, JFullerton, JGosling, MHatto, JJanus, DJones, DJordan, LLewis, CMaas, JMcCarthy, CMercer, MOakman, HPress, NProfit, RSchuerch, FSykes, DTaylor, RJTrifilieff, ATuffnell, A The identification of 7-[(R)-2-((1S,2S)-2-benzyloxycyclopentylamino)-1-hydroxyethyl]-4-hydroxybenzothiazolone as an inhaled long-actingß2-adrenoceptor agonist. Bioorg Med Chem Lett 24:4341-7 (2014)  
Target
Name:
Beta-2 adrenergic receptor
Synonyms:
ADRB2 ADRB2_HUMAN Beta-2 adrenoceptor | Beta-2 adrenoreceptor
Type:
Mol. Mass.:
46461.69
Organism:
Homo sapiens (Human)
Description:
P07550
Residue:
413
  
Inhibitor
Name:
BDBM50055263
Synonyms:
CHEMBL3323654
Type:
Small organic molecule
Emp. Form.:
C19H26N2O3S
Mol. Mass.:
362.486
SMILES:
O[C@@H](CN[C@H]1CCC[C@@H]1C1CCCC1)c1ccc(O)c2[nH]c(=O)sc12
: