Target
Adenosine receptor A2a
Ligand
BDBM50059885
Substrate
Meas. Tech.
ChEMBL_1461353 (CHEMBL3396203)
IC50
18±n/a nM
Citation
 Jörg, MMay, LTMak, FSLee, KCMiller, NDScammells, PJCapuano, B Synthesis and pharmacological evaluation of dual acting ligands targeting the adenosine A2A and dopamine D2 receptors for the potential treatment of Parkinson's disease. J Med Chem 58:718-38 (2015)  
Target
Name:
Adenosine receptor A2a
Synonyms:
A2A adenosine receptor (hA2A) ADENOSINE A2 ADORA2 Adenosine A2A receptor (A2AAR)
Type:
G Protein-Coupled Receptor (GPCR)
Mol. Mass.:
44716.46
Organism:
Homo sapiens (Human)
Description:
P29274
Residue:
412
  
Inhibitor
Name:
BDBM50059885
Synonyms:
CHEMBL3394256
Type:
Small organic molecule
Emp. Form.:
C38H45F3N10O6
Mol. Mass.:
794.8225
SMILES:
[O-]C(=O)C(F)(F)F.CCC[NH+](CCCNC(=O)CCCOc1ccc(CCNc2nc(N)n3nc(nc3n2)-c2ccco2)cc1)CCc1cccc2NC(=O)Cc12
: