Target
5-hydroxytryptamine receptor 1A
Ligand
BDBM50062937
Substrate
Meas. Tech.
ChEMBL_1463279 (CHEMBL3399468)
Ki
0.045000±n/a nM
Citation
 Durham, TBBlanco, MJ Target engagement in lead generation. Bioorg Med Chem Lett 25:998-1008 (2015)  
Target
Name:
5-hydroxytryptamine receptor 1A
Synonyms:
5-HT-1A 5-HT1A 5-hydroxytryptamine receptor 1A (5HT1A) 5ht1a Htr1a Serotonin 1a (5-HT1a) receptor/Adrenergic receptor alpha-1 | Serotonin receptor 1A
Type:
G Protein-Coupled Receptor (GPCR)
Mol. Mass.:
46445.29
Organism:
Rattus norvegicus (rat)
Description:
Binding assays were performed using rat hippocampal membranes.
Residue:
422
  
Inhibitor
Name:
BDBM50062937
Synonyms:
CHEMBL3397908
Type:
Small organic molecule
Emp. Form.:
C33H39N3O8
Mol. Mass.:
605.6781
SMILES:
OC(=O)\C=C\C(O)=O.CNC(=O)c1ccc2ccn(C3CCN(CCc4c(OC)ccc5C(=O)CC(C)(C)Oc45)CC3)c2c1
: