Target
Mu-type opioid receptor
Ligand
BDBM50066359
Substrate
Meas. Tech.
ChEMBL_1465623 (CHEMBL3405071)
Ki
1.8±n/a nM
Citation
 Yuan, YZaidi, SAStevens, DLScoggins, KLMosier, PDKellogg, GEDewey, WLSelley, DEZhang, Y Design, syntheses, and pharmacological characterization of 17-cyclopropylmethyl-3,14ß-dihydroxy-4,5a-epoxy-6a-(isoquinoline-3'-carboxamido)morphinan analogues as opioid receptor ligands. Bioorg Med Chem 23:1701-15 (2015)  
Target
Name:
Mu-type opioid receptor
Synonyms:
M-OR-1 Mor OPRM_MOUSE Oprm | Oprm1
Type:
Enzyme Catalytic Domain
Mol. Mass.:
44431.62
Organism:
MOUSE
Description:
OPIATE Mu OPRM1 MOUSE::P42866
Residue:
398
  
Inhibitor
Name:
BDBM50066359
Synonyms:
CHEMBL3401558
Type:
Small organic molecule
Emp. Form.:
C33H42N4O4
Mol. Mass.:
558.711
SMILES:
[H][C@@]12Oc3c4c(C[C@@]5([H])N(CC6CC6)CC[C@@]14[C@@]5(O)CC[C@@H]2NC(=O)C1Cc2ccc(cc2CN1C)N(C)C)ccc3O
: