Target
High affinity choline transporter 1
Ligand
BDBM50067208
Substrate
Meas. Tech.
ChEMBL_1464246 (CHEMBL3404113)
IC50
1250±n/a nM
Citation
 Bollinger, SREngers, DWEnnis, EAWright, JLocuson, CWLindsley, CWBlakely, RDHopkins, CR Synthesis and structure-activity relationships of a series of 4-methoxy-3-(piperidin-4-yl)oxy benzamides as novel inhibitors of the presynaptic choline transporter. Bioorg Med Chem Lett 25:1757-60 (2015)  
Target
Name:
High affinity choline transporter 1
Synonyms:
CHT1 SC5A7_HUMAN high affinity choline transporter 1
Type:
PROTEIN
Mol. Mass.:
63194.33
Organism:
Homo sapiens (Human)
Description:
ChEMBL_1464247
Residue:
580
  
Inhibitor
Name:
BDBM50067208
Synonyms:
CHEMBL3303292
Type:
Small organic molecule
Emp. Form.:
C21H29N3O4
Mol. Mass.:
387.4727
SMILES:
COc1ccc(cc1OC1CCCN(C)C1)C(=O)NCc1cc(no1)C(C)C
: