Target
Fatty acid synthase
Ligand
BDBM24567
Substrate
Meas. Tech.
ChEMBL_1467008 (CHEMBL3411205)
IC50
203000±n/a nM
Citation
 Fako, VEWu, XPflug, BLiu, JYZhang, JT Repositioning proton pump inhibitors as anticancer drugs by targeting the thioesterase domain of human fatty acid synthase. J Med Chem 58:778-84 (2015)  
Target
Name:
Fatty acid synthase
Synonyms:
FAS FAS_HUMAN HU FASN
Type:
Enzyme
Mol. Mass.:
273419.37
Organism:
Homo sapiens (Human)
Description:
P49327
Residue:
2511
  
Inhibitor
Name:
BDBM24567
Synonyms:
(2S)-1-[(2S,3S)-3-hexyl-4-oxooxetan-2-yl]tridecan-2-yl (2S)-2-formamido-4-methylpentanoate Orlistat Tetrahydrolipstatin Xenical
Type:
Small organic molecule
Emp. Form.:
C29H53NO5
Mol. Mass.:
495.7348
SMILES:
CCCCCCCCCCC[C@@H](C[C@@H]1OC(=O)[C@H]1CCCCCC)OC(=O)[C@H](CC(C)C)NC=O
: