Target
Phosphatidylinositol 4,5-bisphosphate 3-kinase catalytic subunit beta isoform
Ligand
BDBM50070210
Substrate
Meas. Tech.
ChEMBL_1467019 (CHEMBL3411216)
IC50
6.0±n/a nM
Citation
 Barlaam, BCosulich, SDegorce, SFitzek, MGreen, SHancox, ULambert-van der Brempt, CLohmann, JJMaudet, MMorgentin, RPasquet, MJPéru, APlé, PSaleh, TVautier, MWalker, MWard, LWarin, N Discovery of (R)-8-(1-(3,5-difluorophenylamino)ethyl)-N,N-dimethyl-2-morpholino-4-oxo-4H-chromene-6-carboxamide (AZD8186): a potent and selective inhibitor of PI3Kß and PI3Kd for the treatment of PTEN-deficient cancers. J Med Chem 58:943-62 (2015)  
Target
Name:
Phosphatidylinositol 4,5-bisphosphate 3-kinase catalytic subunit beta isoform
Synonyms:
PI3-kinase p110 subunit beta PI3Kbeta PIK3CB Phosphatidylinositol 4,5-bisphosphate 3-kinase catalytic subunit beta (PI3Kbeta) Phosphatidylinositol 4,5-bisphosphate 3-kinase catalytic subunit beta isoform (PI3K) Phosphatidylinositol 4,5-bisphosphate 3-kinase catalytic subunit beta isoform (PI3Kbeta) Phosphatidylinositol-4,5-bisphosphate 3-kinase catalytic subunit beta isoform Phosphoinositide 3-Kinase (PI3K), beta Chain A PtdIns-3-kinase p110
Type:
Enzyme Subunit
Mol. Mass.:
122769.00
Organism:
Homo sapiens (Human)
Description:
P42338
Residue:
1070
  
Inhibitor
Name:
BDBM50070210
Synonyms:
CHEMBL3408267
Type:
Small organic molecule
Emp. Form.:
C23H23F2N3O4
Mol. Mass.:
443.4432
SMILES:
CNC(=O)c1cc([C@@H](C)Nc2cc(F)cc(F)c2)c2oc(cc(=O)c2c1)N1CCOCC1
: