Target
Acetylcholinesterase
Ligand
BDBM8960
Substrate
Meas. Tech.
ChEMBL_1470629 (CHEMBL3420216)
IC50
6.0±n/a nM
Citation
 Rochais, CLecoutey, CGaven, FGiannoni, PHamidouche, KHedou, DDubost, EGenest, DYahiaoui, SFreret, TBouet, VDauphin, FSopkova de Oliveira Santos, JBallandonne, CCorvaisier, SMalzert-Fréon, ALegay, RBoulouard, MClaeysen, SDallemagne, P Novel multitarget-directed ligands (MTDLs) with acetylcholinesterase (AChE) inhibitory and serotonergic subtype 4 receptor (5-HT4R) agonist activities as potential agents against Alzheimer's disease: the design of donecopride. J Med Chem 58:3172-87 (2015)  
Target
Name:
Acetylcholinesterase
Synonyms:
ACES_HUMAN Acetylcholinesterase (AChE) | Acetylcholinesterase (human AChE)
Type:
Enzyme
Mol. Mass.:
67792.70
Organism:
Homo sapiens (Human)
Description:
P22303
Residue:
614
  
Inhibitor
Name:
BDBM8960
Synonyms:
(+/-)-2-[(1-benzylpiperidin-4-yl)methyl]-5,6-dimethoxy-indan-1-one Aricept CHEMBL1678 CHEMBL502 Donepezil E2020 US9346818, DPH US9663465, Donepezil
Type:
Small organic molecule
Emp. Form.:
C24H29NO3
Mol. Mass.:
379.492
SMILES:
COc1cc2CC(CC3CCN(Cc4ccccc4)CC3)C(=O)c2cc1OC
: