Target
Prothrombin
Ligand
BDBM50038001
Substrate
Meas. Tech.
ChEMBL_1472838 (CHEMBL3419500)
IC50
9.5±n/a nM
Citation
 Li, MLRen, YJDong, MHRen, WX Design, synthesis and structural exploration of novel fluorinated dabigatran derivatives as direct thrombin inhibitors. Eur J Med Chem 96:122-38 (2015)  
Target
Name:
Prothrombin
Synonyms:
Activation peptide fragment 1 Coagulation factor II Prothrombin precursor Thrombin heavy chain | Thrombin light chain
Type:
Protein
Mol. Mass.:
70029.57
Organism:
Homo sapiens (Human)
Description:
P00734
Residue:
622
  
Inhibitor
Name:
BDBM50038001
Synonyms:
(2R,4R)-1-((S)-5-(diaminomethyleneamino)-2-(3-methyl-1,2,3,4-tetrahydroquinoline-8-sulfonamido)pentanoyl)-4-methylpiperidine-2-carboxylic acid (2R,4S)-1-[5-Guanidino-2-(3-methyl-1,2,3,4-tetrahydro-quinoline-8-sulfonylamino)-pentanoyl]-4-methyl-piperidine-2-carboxylic acid (S)-1-[5-Guanidino-2-(3-methyl-1,2,3,4-tetrahydro-quinoline-8-sulfonylamino)-pentanoyl]-4-methyl-piperidine-2-carboxylic acid 1-[5-Guanidino-2-(3-methyl-1,2,3,4-tetrahydro-quinoline-8-sulfonylamino)-pentanoyl]-4-methyl-piperidine-2-carboxylic acid ARGATROBAN DK-7419 MCI-9038 | MD-805
Type:
Small organic molecule
Emp. Form.:
C23H36N6O5S
Mol. Mass.:
508.634
SMILES:
C[C@@H]1CCN([C@H](C1)C(O)=O)C(=O)[C@H](CCCNC(N)=N)NS(=O)(=O)c1cccc2CC(C)CNc12
: