Target
Estrogen receptor
Ligand
BDBM50085034
Substrate
Meas. Tech.
ChEMBL_1476876 (CHEMBL3429910)
IC50
3.2±n/a nM
Citation
 Degorce, SLBailey, ACallis, RDe Savi, CDucray, RLamont, GMacFaul, PMaudet, MMartin, SMorgentin, RNorman, RAPeru, APink, JHPlé, PARoberts, BScott, JS Investigation of (E)-3-[4-(2-Oxo-3-aryl-chromen-4-yl)oxyphenyl]acrylic Acids as Oral Selective Estrogen Receptor Down-Regulators. J Med Chem 58:3522-33 (2015)  
Target
Name:
Estrogen receptor
Synonyms:
ER ESR ESR1_HUMAN Estrogen receptor Estrogen receptor (ER-alpha) Estrogen receptor alpha (ER) Nuclear receptor subfamily 3 group A member 1
Type:
Protein
Mol. Mass.:
66230.44
Organism:
Homo sapiens (Human)
Description:
P03372
Residue:
595
  
Inhibitor
Name:
BDBM50085034
Synonyms:
CHEMBL3427407
Type:
Small organic molecule
Emp. Form.:
C25H16F2O6
Mol. Mass.:
450.3877
SMILES:
Cc1cc(F)ccc1-c1c(Oc2ccc(\C=C\C(O)=O)cc2)c2ccc(O)c(F)c2oc1=O
: