Target
Sodium/nucleoside cotransporter 2
Ligand
BDBM50340678
Substrate
Meas. Tech.
ChEMBL_1477251 (CHEMBL3428943)
IC50
>1000000±n/a nM
Citation
 Tatani, KHiratochi, MNonaka, YIsaji, MShuto, S Identification of 8-aminoadenosine derivatives as a new class of human concentrative nucleoside transporter 2 inhibitors. ACS Med Chem Lett 6:244-8 (2015)  
Target
Name:
Sodium/nucleoside cotransporter 2
Synonyms:
CNT2 SLC28A2
Type:
PROTEIN
Mol. Mass.:
71934.06
Organism:
Homo sapiens (Human)
Description:
ChEMBL_1477251
Residue:
658
  
Inhibitor
Name:
BDBM50340678
Synonyms:
1-(beta-D-2-deoxy-erythro-pentofuranosyl)-5-fluorouracil 5-Fluoro-1-((2R,4S,5R)-4-hydroxy-5-hydroxymethyl-tetrahydro-furan-2-yl)-1H-pyrimidine-2,4-dione 5-fluoro-1-((2R,4S,5R)-4-hydroxy-5-(hydroxymethyl)-tetrahydrofuran-2-yl)pyrimidine-2,4(1H,3H)-dione 5-fluoro-2'-Deoxy-uridine CHEMBL917 FUDR | Fluoruridine Deoxyribose
Type:
Small organic molecule
Emp. Form.:
C9H11FN2O5
Mol. Mass.:
246.1924
SMILES:
OC[C@H]1O[C@H](C[C@@H]1O)n1cc(F)c(=O)[nH]c1=O
: