Target
Dual specificity protein phosphatase 3
Ligand
BDBM50087856
Substrate
Meas. Tech.
ChEMBL_1476068 (CHEMBL3428698)
pH
7±n/a
IC50
6000±n/a nM
Comments
extracted
Citation
 He, YGuo, XYu, ZHWu, LGunawan, AMZhang, YDixon, JEZhang, ZY A potent and selective inhibitor for the UBLCP1 proteasome phosphatase. Bioorg Med Chem 23:2798-809 (2015)  
Target
Name:
Dual specificity protein phosphatase 3
Synonyms:
DUS3_HUMAN Dual specificity protein phosphatase (VHR) Dual specificity protein phosphatase VHR Tyrosine-protein phosphatase non-receptor type 1 | VHR
Type:
Hydrolase
Mol. Mass.:
20480.58
Organism:
Homo sapiens (Human)
Description:
Residue:
185
  
Inhibitor
Name:
BDBM50087856
Synonyms:
CHEMBL3426913
Type:
Small organic molecule
Emp. Form.:
C28H30F3NO6
Mol. Mass.:
533.5361
SMILES:
CCCCC(Oc1cc(O)c(cc1C#Cc1ccccc1OC(F)(F)F)C(O)=O)C(=O)NC1CCCCC1
: