Target
Tyrosine-protein phosphatase non-receptor type 1
Ligand
BDBM50087856
Substrate
Meas. Tech.
ChEMBL_1476064 (CHEMBL3428560)
pH
7±n/a
IC50
12800±n/a nM
Comments
extracted
Citation
 He, YGuo, XYu, ZHWu, LGunawan, AMZhang, YDixon, JEZhang, ZY A potent and selective inhibitor for the UBLCP1 proteasome phosphatase. Bioorg Med Chem 23:2798-809 (2015)  
Target
Name:
Tyrosine-protein phosphatase non-receptor type 1
Synonyms:
PTN1_HUMAN PTPN1 Protein tyrosine phosphatase-1B (PTP1B) Protein-tyrosine phosphatase 1B (PTP1B) Tyrosine-protein phosphatase non-receptor type 1 (PTP1B)
Type:
Protein phosphatase
Mol. Mass.:
49963.76
Organism:
Homo sapiens (Human)
Description:
Human recombinant GST-fusion PTP1B (1-435).
Residue:
435
  
Inhibitor
Name:
BDBM50087856
Synonyms:
CHEMBL3426913
Type:
Small organic molecule
Emp. Form.:
C28H30F3NO6
Mol. Mass.:
533.5361
SMILES:
CCCCC(Oc1cc(O)c(cc1C#Cc1ccccc1OC(F)(F)F)C(O)=O)C(=O)NC1CCCCC1
: