Target
Voltage-dependent L-type calcium channel subunit alpha-1C
Ligand
BDBM25761
Substrate
Meas. Tech.
ChEMBL_1479146 (CHEMBL3436122)
IC50
18000±n/a nM
Citation
 Wisniowska, BMendyk, AFijorek, KGlinka, APolak, S Predictive model for L-type channel inhibition: multichannel block in QT prolongation risk assessment. J Appl Toxicol 32:858-66 (2012)  
Target
Name:
Voltage-dependent L-type calcium channel subunit alpha-1C
Synonyms:
CAC1C_CAVPO CACH2 CACNA1C CCHL1A1 Voltage-dependent L-type calcium channel subunit alpha-1C | Voltage-gated calcium channel subunit alpha Cav1.2
Type:
PROTEIN
Mol. Mass.:
19518.62
Organism:
Cavia porcellus
Description:
ChEMBL_106600
Residue:
169
  
Inhibitor
Name:
BDBM25761
Synonyms:
Anapriline CHEMBL27 PROPRANOLOL, d PROPRANOLOL,(+) Propanolol Propranolol | [2-hydroxy-3-(naphthalen-1-yloxy)propyl](propan-2-yl)amine
Type:
Small organic molecule
Emp. Form.:
C16H21NO2
Mol. Mass.:
259.3434
SMILES:
CC(C)NCC(O)COc1cccc2ccccc12
: