Target
ATP-binding cassette sub-family C member 4
Ligand
BDBM50172903
Substrate
Meas. Tech.
ChEMBL_1486828 (CHEMBL3535467)
Ki
7000±n/a nM
Citation
 Wittgen, HGvan den Heuvel, JJvan den Broek, PHDinter-Heidorn, HKoenderink, JBRussel, FG Cannabinoid type 1 receptor antagonists modulate transport activity of multidrug resistance-associated proteins MRP1, MRP2, MRP3, and MRP4. Drug Metab Dispos 39:1294-302 (2011)  
Target
Name:
ATP-binding cassette sub-family C member 4
Synonyms:
ABCC4 MOAT-B MRP/cMOAT-related ABC transporter MRP4_HUMAN Multidrug resistance-associated protein 4
Type:
PROTEIN
Mol. Mass.:
149546.12
Organism:
Homo sapiens (Human)
Description:
ChEMBL_1486828
Residue:
1325
  
Inhibitor
Name:
BDBM50172903
Synonyms:
3,4-diarylpyrazoline derivative | CHEMBL364300
Type:
Small organic molecule
Emp. Form.:
C20H24ClN5O2S
Mol. Mass.:
433.955
SMILES:
CCN(C)S(=O)(=O)NC(=NC)N1CC(C(=N1)c1ccc(Cl)cc1)c1ccccc1
: