Target
UDP-glucuronosyltransferase 1A1
Ligand
BDBM85507
Substrate
Meas. Tech.
ChEMBL_1486475 (CHEMBL3531465)
IC50
53000±n/a nM
Citation
 Zhou, JTracy, TSRemmel, RP Correlation between bilirubin glucuronidation and estradiol-3-gluronidation in the presence of model UDP-glucuronosyltransferase 1A1 substrates/inhibitors. Drug Metab Dispos 39:322-9 (2011)  
Target
Name:
UDP-glucuronosyltransferase 1A1
Synonyms:
Bilirubin-specific UDPGT isozyme 1 UD11_HUMAN UDP-glucuronosyltransferase 1-A UDPGT 1-1 UGT1 UGT1-01 UGT1A Uridine-5'-diphosphoglucuronosyltransferase 1A1 | hUG-BR1
Type:
Enzyme
Mol. Mass.:
59604.34
Organism:
Homo sapiens (Human)
Description:
P22309
Residue:
533
  
Inhibitor
Name:
BDBM85507
Synonyms:
CAS_4394-00-7 Niflumic acid US10278929, Niflumic acid US20240002326, Compound Niflumic acid
Type:
Small organic molecule
Emp. Form.:
C13H9F3N2O2
Mol. Mass.:
282.218
SMILES:
OC(=O)c1cccnc1Nc1cccc(c1)C(F)(F)F
: