Target
Sodium channel protein type 9 subunit alpha
Ligand
BDBM50003659
Substrate
Meas. Tech.
ChEMBL_1499306 (CHEMBL3583448)
Ki
32700±n/a nM
Citation
 Lynch, SMTafesse, LCarlin, KGhatak, PKyle, DJ Dibenzazepines and dibenzoxazepines as sodium channel blockers. Bioorg Med Chem Lett 25:43-7 (2015)  
Target
Name:
Sodium channel protein type 9 subunit alpha
Synonyms:
NENA Peripheral sodium channel 1 SCN9A_HUMAN Voltage-gated sodium channel subunit Nav1.7 hNE-Na
Type:
Protein
Mol. Mass.:
226375.97
Organism:
Homo sapiens (Human)
Description:
Q15858
Residue:
1988
  
Inhibitor
Name:
BDBM50003659
Synonyms:
5H-dibenzo[b,f]azepine-5-carboxamide CARBATROL DIBENZO[B,F]AZEPINE-5-CARBOXYLIC ACID AMIDE(CARBAMAZEPINE) EQUETRO TEGRETOL TERIL US9144538, Carbamazepine
Type:
Small organic molecule
Emp. Form.:
C15H12N2O
Mol. Mass.:
236.2686
SMILES:
NC(=O)N1c2ccccc2C=Cc2ccccc12
: