Target
Alpha-1A adrenergic receptor
Ligand
BDBM50091351
Substrate
Meas. Tech.
ChEMBL_1497770 (CHEMBL3583290)
IC50
2.5±n/a nM
Citation
 Zhang, WMa, ZLi, WLi, GChen, LLiu, ZDu, LLi, M Discovery of Quinazoline-Based Fluorescent Probes toa1-Adrenergic Receptors. ACS Med Chem Lett 6:502-6 (2015)  
Target
Name:
Alpha-1A adrenergic receptor
Synonyms:
ADA1A_HUMAN ADRA1C Alpha 1A-adrenoceptor Alpha adrenergic receptor 1a Alpha-adrenergic receptor 1c adrenergic Alpha1 | adrenergic Alpha1C
Type:
Cell-surface receptors
Mol. Mass.:
51511.67
Organism:
Homo sapiens (Human)
Description:
P35348
Residue:
466
  
Inhibitor
Name:
BDBM50091351
Synonyms:
CHEMBL3582269
Type:
Small organic molecule
Emp. Form.:
C26H24N8O6
Mol. Mass.:
544.5188
SMILES:
COc1cc2nc(nc(N)c2cc1OC)N1CCN(CC1)C(=O)c1cn(nn1)-c1cc2ccc(O)cc2oc1=O
: