Target
ATPase family AAA domain-containing protein 2B
Ligand
BDBM50092310
Substrate
Meas. Tech.
ChEMBL_1498195 (CHEMBL3583519)
Kd
>10000±n/a nM
Citation
 Ran, XZhao, YLiu, LBai, LYang, CYZhou, BMeagher, JLChinnaswamy, KStuckey, JAWang, S Structure-Based Design of¿-Carboline Analogues as Potent and Specific BET Bromodomain Inhibitors. J Med Chem 58:4927-39 (2015)  
Target
Name:
ATPase family AAA domain-containing protein 2B
Synonyms:
ATAD2B ATPase family AAA domain-containing protein 2B | KIAA1240
Type:
PROTEIN
Mol. Mass.:
164918.65
Organism:
Homo sapiens (Human)
Description:
ChEMBL_105350
Residue:
1458
  
Inhibitor
Name:
BDBM50092310
Synonyms:
CHEMBL3581661 | US9675697, Cpd. No. 23
Type:
Small organic molecule
Emp. Form.:
C24H23N5O2
Mol. Mass.:
413.4717
SMILES:
COc1cc2c(cc1-c1c(C)noc1C)[nH]c1ccnc(-c3c(C)[nH]nc3C3CC3)c21
: