Target
Epidermal growth factor receptor
Ligand
BDBM50092474
Substrate
Meas. Tech.
ChEMBL_1500854 (CHEMBL3588418)
IC50
13200±n/a nM
Citation
 Li, SNXu, YYGao, JYYin, HRZhang, SLLi, HQ Combination of 4-anilinoquinazoline and rhodanine as novel epidermal growth factor receptor tyrosine kinase inhibitors. Bioorg Med Chem 23:3221-7 (2015)  
Target
Name:
Epidermal growth factor receptor
Synonyms:
EGF Receptor Substrate EGFR_HUMAN ERBB1 Epidermal Growth Factor Receptor erbB-1 Epidermal growth factor receptor (EGFR) HER1 Proto-oncogene c-ErbB-1 Tyrosine-Protein Kinase ErbB-1
Type:
Receptor Kinase Domain
Mol. Mass.:
134279.59
Organism:
Homo sapiens (Human)
Description:
P00533
Residue:
1210
  
Inhibitor
Name:
BDBM50092474
Synonyms:
CHEMBL3586189
Type:
Small organic molecule
Emp. Form.:
C35H27ClN6O2S
Mol. Mass.:
631.146
SMILES:
Clc1cccc(Nc2ncnc3ccc(NC(=O)[C@@H]4CCCN4C4=NC(=O)\C(S4)=C/c4ccc(cc4)-c4ccccc4)cc23)c1
: