Target
Acetylcholinesterase
Ligand
BDBM50357212
Substrate
Meas. Tech.
ChEMBL_1504214 (CHEMBL3591974)
IC50
15±n/a nM
Citation
 Heller, LSchwarz, SObernauer, ACsuk, R Allobetulin derived seco-oleananedicarboxylates act as inhibitors of acetylcholinesterase. Bioorg Med Chem Lett 25:2654-6 (2015)  
Target
Name:
Acetylcholinesterase
Synonyms:
ACES_ELEEL Acetylcholinesterase (EeAChE) | ache
Type:
Enzyme
Mol. Mass.:
71812.79
Organism:
Electrophorus electricus (Electric eel)
Description:
Residue:
633
  
Inhibitor
Name:
BDBM50357212
Synonyms:
(L)-SERINE | Serine
Type:
Small organic molecule
Emp. Form.:
C3H7NO3
Mol. Mass.:
105.0926
SMILES:
N[C@@H](CO)C(O)=O
: