Target
Catenin beta-1
Ligand
BDBM50094600
Substrate
Meas. Tech.
ChEMBL_1504364 (CHEMBL3592701)
Ki
8800±n/a nM
Citation
 Catrow, JLZhang, YZhang, MJi, H Discovery of Selective Small-Molecule Inhibitors for the฿-Catenin/T-Cell Factor Protein-Protein Interaction through the Optimization of the Acyl Hydrazone Moiety. J Med Chem 58:4678-92 (2015)  
Target
Name:
Catenin beta-1
Synonyms:
CTNB1_HUMAN CTNNB1
Type:
PROTEIN
Mol. Mass.:
85484.08
Organism:
Homo sapiens (Human)
Description:
ChEMBL_1504364
Residue:
781
  
Inhibitor
Name:
BDBM50094600
Synonyms:
CHEMBL2323029
Type:
Small organic molecule
Emp. Form.:
C21H12Cl2N2O2
Mol. Mass.:
395.238
SMILES:
OC(=O)c1ccc2nc(-c3ccc(Cl)cc3)c(nc2c1)-c1ccc(Cl)cc1
: