Target
Catenin beta-1
Ligand
BDBM50094486
Substrate
Meas. Tech.
ChEMBL_1504365 (CHEMBL3592702)
Ki
18000±n/a nM
Citation
 Catrow, JLZhang, YZhang, MJi, H Discovery of Selective Small-Molecule Inhibitors for the฿-Catenin/T-Cell Factor Protein-Protein Interaction through the Optimization of the Acyl Hydrazone Moiety. J Med Chem 58:4678-92 (2015)  
Target
Name:
Catenin beta-1
Synonyms:
CTNB1_HUMAN CTNNB1
Type:
PROTEIN
Mol. Mass.:
85484.08
Organism:
Homo sapiens (Human)
Description:
ChEMBL_1504364
Residue:
781
  
Inhibitor
Name:
BDBM50094486
Synonyms:
CHEMBL3589160
Type:
Small organic molecule
Emp. Form.:
C13H9N9O
Mol. Mass.:
307.2703
SMILES:
C(Cn1c2ccccc2c2nc3nonc3nc12)c1nn[nH]n1
: