Target
Carbonic anhydrase 2
Ligand
BDBM26987
Substrate
Meas. Tech.
ChEMBL_1504762 (CHEMBL3595047)
Ki
73000000±n/a nM
Citation
 De Luca, VVullo, DDel Prete, SCarginale, VScozzafava, AOsman, SMAlOthman, ZSupuran, CTCapasso, C Cloning, characterization and anion inhibition studies of a new¿-carbonic anhydrase from the Antarctic bacterium Pseudoalteromonas haloplanktis. Bioorg Med Chem 23:4405-9 (2015)  
Target
Name:
Carbonic anhydrase 2
Synonyms:
CA-II CAC Carbonate dehydratase II Carbonic anhydrase 2 (CA-II) Carbonic anhydrase C Carbonic anhydrase II (CA-II) Carbonic anhydrase II (hCA II) | Carbonic anhydrase isoenzyme II (hCA II)
Type:
Enzyme
Mol. Mass.:
29250.71
Organism:
Homo sapiens (Human)
Description:
P00918
Residue:
260
  
Inhibitor
Name:
BDBM26987
Synonyms:
CHEMBL180485 SODIUM CARBONATE carbonate ion
Type:
Ion
Emp. Form.:
CO3
Mol. Mass.:
60.01
SMILES:
[O-]C([O-])=O
: