Target
Bifunctional epoxide hydrolase 2
Ligand
BDBM50100540
Substrate
Meas. Tech.
ChEMBL_1455803 (CHEMBL3361515)
Ki
0.490000±n/a nM
Citation
 Lee, KSLiu, JYWagner, KMPakhomova, SDong, HMorisseau, CFu, SHYang, JWang, PUlu, AMate, CANguyen, LVHwang, SHEdin, MLMara, AAWulff, HNewcomer, MEZeldin, DCHammock, BD Optimized inhibitors of soluble epoxide hydrolase improve in vitro target residence time and in vivo efficacy. J Med Chem 57:7016-30 (2014)  
Target
Name:
Bifunctional epoxide hydrolase 2
Synonyms:
Cytosolic epoxide hydrolase 2 EPHX2 HYES_HUMAN Soluble epoxide hydrolase (sEH) | epoxide hydrolase 2, cytoplasmic
Type:
Enzyme
Mol. Mass.:
62613.07
Organism:
Homo sapiens (Human)
Description:
P34913
Residue:
555
  
Inhibitor
Name:
BDBM50100540
Synonyms:
CHEMBL3327068
Type:
Small organic molecule
Emp. Form.:
C18H24F3N3O2
Mol. Mass.:
371.3973
SMILES:
CC(C)CC(=O)N1CCC(CC1)NC(=O)Nc1ccc(cc1)C(F)(F)F
: