Target
Cytochrome P450 2A13
Ligand
BDBM50008072
Substrate
Meas. Tech.
ChEMBL_1486539 (CHEMBL3532208)
Ki
1400±n/a nM
Citation
 Stephens, ESWalsh, AAScott, EE Evaluation of inhibition selectivity for human cytochrome P450 2A enzymes. Drug Metab Dispos 40:1797-802 (2012)  
Target
Name:
Cytochrome P450 2A13
Synonyms:
CP2AD_HUMAN CYPIIA13 | Cytochrome P450 2A13 (CYP2A13)
Type:
Protein
Mol. Mass.:
56702.46
Organism:
Homo sapiens (Human)
Description:
Q16696
Residue:
494
  
Inhibitor
Name:
BDBM50008072
Synonyms:
(+)-pilocarpine (3S,4R)-3-ethyldihydro-4-((1-methyl-1H-imidazol-5-yl)methyl)-2(3H)-furanone CHEMBL550 PILOCARPINE | PILOCARPINE HYDROCHLORIDE
Type:
Small organic molecule
Emp. Form.:
C11H16N2O2
Mol. Mass.:
208.2569
SMILES:
CC[C@H]1[C@@H](Cc2cncn2C)COC1=O
: