Target
Cytochrome P450 3A4
Ligand
BDBM50241293
Substrate
Meas. Tech.
ChEMBL_1487309 (CHEMBL3534776)
IC50
>30000±n/a nM
Citation
 Lee, CAJones, JPKatayama, JKaspera, RJiang, YFreiwald, SSmith, EWalker, GSTotah, RA Identifying a selective substrate and inhibitor pair for the evaluation of CYP2J2 activity. Drug Metab Dispos 40:943-51 (2012)  
Target
Name:
Cytochrome P450 3A4
Synonyms:
Albendazole monooxygenase CP3A4_HUMAN CYP3A4 CYPIIIA4 Cytochrome P450 3A4 (CYP3A4) Nifedipine oxidase Taurochenodeoxycholate 6-alpha-hydroxylase
Type:
Enzyme
Mol. Mass.:
57349.57
Organism:
Homo sapiens (Human)
Description:
Residue:
503
  
Inhibitor
Name:
BDBM50241293
Synonyms:
(5-Propylsulfanyl-1H-benzoimidazol-2-yl)-carbamic acid methyl ester Albenza SK&F-62979 methyl 6-(propylthio)-1H-benzo[d]imidazol-2-ylcarbamate
Type:
Small organic molecule
Emp. Form.:
C12H15N3O2S
Mol. Mass.:
265.331
SMILES:
CCCSc1ccc2nc(NC(=O)OC)[nH]c2c1
: