Target
Cytochrome P450 2D6
Ligand
BDBM50151865
Substrate
Meas. Tech.
ChEMBL_1487308 (CHEMBL3534775)
IC50
>30000±n/a nM
Citation
 Lee, CAJones, JPKatayama, JKaspera, RJiang, YFreiwald, SSmith, EWalker, GSTotah, RA Identifying a selective substrate and inhibitor pair for the evaluation of CYP2J2 activity. Drug Metab Dispos 40:943-51 (2012)  
Target
Name:
Cytochrome P450 2D6
Synonyms:
CP2D6_HUMAN CYP2DL1 Cytochrome P450 2D6 (CYP2D6) P450-DB1
Type:
Protein
Mol. Mass.:
55774.82
Organism:
Homo sapiens (Human)
Description:
P10635
Residue:
497
  
Inhibitor
Name:
BDBM50151865
Synonyms:
CHEMBL172 | MEFLOQUINE
Type:
Small organic molecule
Emp. Form.:
C17H16F6N2O
Mol. Mass.:
378.3122
SMILES:
O[C@H]([C@H]1CCCCN1)c1cc(nc2c(cccc12)C(F)(F)F)C(F)(F)F
: