Target
Cytochrome P450 1A2
Ligand
BDBM50062614
Substrate
Meas. Tech.
ChEMBL_1493769 (CHEMBL3530852)
IC50
>30000±n/a nM
Citation
 Lee, CAJones, JPKatayama, JKaspera, RJiang, YFreiwald, SSmith, EWalker, GSTotah, RA Identifying a selective substrate and inhibitor pair for the evaluation of CYP2J2 activity. Drug Metab Dispos 40:943-51 (2012)  
Target
Name:
Cytochrome P450 1A2
Synonyms:
CP1A2_HUMAN CYPIA2 Cytochrome P(3)450 Cytochrome P450 1A2 (CYP1A2) Cytochrome P450-P3
Type:
Enzyme
Mol. Mass.:
58423.38
Organism:
Homo sapiens (Human)
Description:
P05177
Residue:
516
  
Inhibitor
Name:
BDBM50062614
Synonyms:
CHEMBL900 Disipal N,N-dimethyl-2-(phenyl(o-tolyl)methoxy)ethanamine Norgesic Orphengesic
Type:
Small organic molecule
Emp. Form.:
C18H23NO
Mol. Mass.:
269.3813
SMILES:
CN(C)CCOC(c1ccccc1)c1ccccc1C
: