Target
Cytochrome P450 2J2
Ligand
BDBM50131434
Substrate
Meas. Tech.
ChEMBL_1485701 (CHEMBL3541093)
IC50
>50000±n/a nM
Citation
 Ren, SZeng, JMei, YZhang, JZYan, SFFei, JChen, L Discovery and characterization of novel, potent, and selective cytochrome P450 2J2 inhibitors. Drug Metab Dispos 41:60-71 (2012)  
Target
Name:
Cytochrome P450 2J2
Synonyms:
CP2J2_HUMAN | CYP2J2
Type:
Enzyme
Mol. Mass.:
57623.04
Organism:
Homo sapiens (Human)
Description:
P51589
Residue:
502
  
Inhibitor
Name:
BDBM50131434
Synonyms:
CHEMBL652 N-(piperidin-2-ylmethyl)-2,5-bis(2,2,2-trifluoroethoxy)benzamide N-Piperidin-2-ylmethyl-2,5-bis-(2,2,2-trifluoro-ethoxy)-benzamide (Flecainide) N-Piperidin-2-ylmethyl-2,5-bis-(2,2,2-trifluoro-ethoxy)-benzamide(Flecanide) | Tambocor
Type:
Small organic molecule
Emp. Form.:
C17H20F6N2O3
Mol. Mass.:
414.3427
SMILES:
FC(F)(F)COc1ccc(OCC(F)(F)F)c(c1)C(=O)NCC1CCCCN1
: