Target
3-hydroxy-3-methylglutaryl-coenzyme A reductase
Ligand
BDBM50104750
Substrate
Meas. Tech.
ChEMBL_1506153 (CHEMBL3594629)
IC50
>100000±n/a nM
Citation
 Wang, KBao, LXiong, WMa, KHan, JWang, WYin, WLiu, H Lanostane Triterpenes from the Tibetan Medicinal Mushroom Ganoderma leucocontextum and Their Inhibitory Effects on HMG-CoA Reductase anda-Glucosidase. J Nat Prod 78:1977-89 (2015)  
Target
Name:
3-hydroxy-3-methylglutaryl-coenzyme A reductase
Synonyms:
3-hydroxy-3-methylglutaryl-coenzyme A reductase HMG-CoA reductase HMGR
Type:
PROTEIN
Mol. Mass.:
97149.70
Organism:
Sus scrofa
Description:
ChEMBL_109835
Residue:
885
  
Inhibitor
Name:
BDBM50104750
Synonyms:
CHEMBL3594156
Type:
Small organic molecule
Emp. Form.:
C51H74O7
Mol. Mass.:
799.1291
SMILES:
[H][C@@]1([#6]-[#6][C@@]2([#6])[#6]-3=[#6]-[#6][C@@]4([H])C([#6])([#6])[#6](=O)-[#6]-[#6][C@]4([#6])[#6]-3=[#6]-[#6][C@]12[#6])[#6@H](-[#6])-[#6]-[#6]-[#6@H](-[#8]-[#6](=O)-[#6](\[#6]-[#6]\[#6]=[#6](/[#6])-[#6]-[#6]\[#6]=[#6](\[#6])-[#6])=[#6]\[#6]-c1cc(-[#8])ccc1-[#8])[C@]([#6])([#8])[#6]-[#8]
: