Target
3-hydroxy-3-methylglutaryl-coenzyme A reductase
Ligand
BDBM50104768
Substrate
Meas. Tech.
ChEMBL_1506153 (CHEMBL3594629)
IC50
>100000±n/a nM
Citation
 Wang, KBao, LXiong, WMa, KHan, JWang, WYin, WLiu, H Lanostane Triterpenes from the Tibetan Medicinal Mushroom Ganoderma leucocontextum and Their Inhibitory Effects on HMG-CoA Reductase anda-Glucosidase. J Nat Prod 78:1977-89 (2015)  
Target
Name:
3-hydroxy-3-methylglutaryl-coenzyme A reductase
Synonyms:
3-hydroxy-3-methylglutaryl-coenzyme A reductase HMG-CoA reductase HMGR
Type:
PROTEIN
Mol. Mass.:
97149.70
Organism:
Sus scrofa
Description:
ChEMBL_109835
Residue:
885
  
Inhibitor
Name:
BDBM50104768
Synonyms:
CHEMBL3594159
Type:
Small organic molecule
Emp. Form.:
C30H44O5
Mol. Mass.:
484.6674
SMILES:
[H][C@@]1(CC[C@@]2(C)C3=C(C(O)C[C@]12C)[C@@]1(C)CCC(=O)C(C)(C)[C@]1([H])CC3=O)[C@H](C)CC\C=C(\C)C(O)=O
: