Target
Adenosylhomocysteinase
Ligand
BDBM50050875
Substrate
Meas. Tech.
ChEMBL_1507791 (CHEMBL3598548)
IC50
49±n/a nM
Citation
 Nakao, ASuzuki, HUeno, HIwasaki, HSetsuta, TKashima, ASunada, S Discovery and structural analyses of S-adenosyl-L-homocysteine hydrolase inhibitors based on non-adenosine analogs. Bioorg Med Chem 23:4952-69 (2015)  
Target
Name:
Adenosylhomocysteinase
Synonyms:
AHCY SAHH | SAHH_HUMAN
Type:
PROTEIN
Mol. Mass.:
47714.06
Organism:
Homo sapiens (Human)
Description:
ChEMBL_1507791
Residue:
432
  
Inhibitor
Name:
BDBM50050875
Synonyms:
CHEMBL3322549
Type:
Small organic molecule
Emp. Form.:
C28H38Cl2N6O5S
Mol. Mass.:
641.61
SMILES:
CN(N1CCN(CC1)S(C)(=O)=O)C(=O)CN(CC(=O)NCCN1CCCC1)c1cc(Cl)ccc1Oc1ccc(Cl)cc1
: