Target
Amine oxidase [flavin-containing] B
Ligand
BDBM10849
Substrate
Meas. Tech.
ChEMBL_1509992 (CHEMBL3608045)
Ki
3800000±n/a nM
Citation
 Carradori, SSilvestri, R New Frontiers in Selective Human MAO-B Inhibitors. J Med Chem 58:6717-32 (2015)  
Target
Name:
Amine oxidase [flavin-containing] B
Synonyms:
AOFB_HUMAN MAOB Monoamine oxidase type B (MAO B) Monoamine oxidase type B (MAOB)
Type:
Protein
Mol. Mass.:
58768.76
Organism:
Homo sapiens (Human)
Description:
P27338
Residue:
520
  
Inhibitor
Name:
BDBM10849
Synonyms:
1,3,7-trimethyl-2,3,6,7-tetrahydro-1H-purine-2,6-dione CHEMBL113 caffeine
Type:
Small organic molecule
Emp. Form.:
C8H10N4O2
Mol. Mass.:
194.1906
SMILES:
Cn1cnc2n(C)c(=O)n(C)c(=O)c12
: