Target
Adenosine receptor A3
Ligand
BDBM50069812
Substrate
Meas. Tech.
ChEMBL_1515687 (CHEMBL3616301)
IC50
8500±n/a nM
Citation
 Tosh, DKCrane, SChen, ZPaoletta, SGao, ZGGizewski, EAuchampach, JASalvemini, DJacobson, KA Rigidified A3 Adenosine Receptor Agonists: 1-Deazaadenine Modification Maintains High in Vivo Efficacy. ACS Med Chem Lett 6:804-8 (2015)  
Target
Name:
Adenosine receptor A3
Synonyms:
AA3R_CANLF Adenosine receptor A3
Type:
PROTEIN
Mol. Mass.:
35914.81
Organism:
Canis lupus familiaris
Description:
ChEMBL_109866
Residue:
314
  
Inhibitor
Name:
BDBM50069812
Synonyms:
CHEMBL3407784
Type:
Small organic molecule
Emp. Form.:
C20H19ClN6O3S
Mol. Mass.:
458.921
SMILES:
[H][C@]12C[C@]1([C@@H](O)[C@@H](O)[C@@H]2n1cnc2c(NC)nc(nc12)C#Cc1ccc(Cl)s1)C(=O)NC
: