Target
Beta-1,4-mannosyl-glycoprotein 4-beta-N-acetylglucosaminyltransferase
Ligand
BDBM50117667
Substrate
Meas. Tech.
ChEMBL_1515039 (CHEMBL3616251)
IC50
794±n/a nM
Citation
 Huard, KLondregan, ATTesz, GBahnck, KBMagee, TVHepworth, DPolivkova, JCoffey, SBPabst, BAGosset, JRNigam, AKou, KSun, HLee, KHerr, MBoehm, MCarpino, PAGoodwin, BPerreault, CLi, QJorgensen, CCTkalcevic, GTSubashi, TAAhn, K Discovery of Selective Small Molecule Inhibitors of Monoacylglycerol Acyltransferase 3. J Med Chem 58:7164-72 (2015)  
Target
Name:
Beta-1,4-mannosyl-glycoprotein 4-beta-N-acetylglucosaminyltransferase
Synonyms:
GGNT3 GlcNAc-T III MGAT3_HUMAN N-glycosyl-oligosaccharide-glycoprotein N-acetylglucosaminyltransferase III
Type:
PROTEIN
Mol. Mass.:
61324.81
Organism:
Homo sapiens (Human)
Description:
ChEMBL_107586
Residue:
533
  
Inhibitor
Name:
BDBM50117667
Synonyms:
CHEMBL3613711
Type:
Small organic molecule
Emp. Form.:
C24H27N5O5S
Mol. Mass.:
497.567
SMILES:
COc1cccc(CC(=O)N2Cc3ccc(cc3C2)S(=O)(=O)Nc2cnn(n2)C2CCCOC2)c1
: