Target
A disintegrin and metalloproteinase with thrombospondin motifs 4
Ligand
BDBM50122449
Substrate
Meas. Tech.
ChEMBL_1519714 (CHEMBL3624059)
IC50
10.0±n/a nM
Citation
 Ding, YO'Keefe, HDeLorey, JLIsrael, DIMesser, JAChiu, CHSkinner, SRMatico, REMurray-Thompson, MFLi, FClark, MACuozzo, JWArico-Muendel, CMorgan, BA Discovery of Potent and Selective Inhibitors for ADAMTS-4 through DNA-Encoded Library Technology (ELT). ACS Med Chem Lett 6:888-93 (2015)  
Target
Name:
A disintegrin and metalloproteinase with thrombospondin motifs 4
Synonyms:
A disintegrin and metalloproteinase with thrombospondin motifs 4 (ADAMTS-4) ATS4_HUMAN KIAA0688 | Metalloproteinase with thrombospondin motifs 4 (ADAMTS-4)
Type:
Enzyme
Mol. Mass.:
90214.54
Organism:
Homo sapiens (Human)
Description:
O75173
Residue:
837
  
Inhibitor
Name:
BDBM50122449
Synonyms:
CHEMBL3622483
Type:
Small organic molecule
Emp. Form.:
C38H49N9O3
Mol. Mass.:
679.8542
SMILES:
CCN(C(=O)c1ccc(CNc2nc(NCCN3CCN(C)CC3)nc(n2)N2CCc3cc(OC)c(OC)cc3C2)cc1)c1cccc(C)c1
: