Target
Isocitrate dehydrogenase [NADP] cytoplasmic
Ligand
BDBM50241453
Substrate
Meas. Tech.
ChEMBL_1525980 (CHEMBL3635916)
Ki
3170±n/a nM
Citation
 Kim, HJFei, XCho, SCChoi, BYAhn, HCLee, KSeo, SYKeum, YS Discovery ofa-mangostin as a novel competitive inhibitor against mutant isocitrate dehydrogenase-1. Bioorg Med Chem Lett 25:5625-31 (2015)  
Target
Name:
Isocitrate dehydrogenase [NADP] cytoplasmic
Synonyms:
Cytosolic NADP-isocitrate dehydrogenase IDH1 IDP Isocitrate dehydrogenase 1 (IDH1) Oxalosuccinate decarboxylase | PICD
Type:
Protein
Mol. Mass.:
46661.29
Organism:
Homo sapiens (Human)
Description:
O75874
Residue:
414
  
Inhibitor
Name:
BDBM50241453
Synonyms:
1,3,6,7-tetrahydroxy-2,8-bis(3-methylbut-2-enyl)-9H-xanthen-9-one gamma-mangostin
Type:
Small organic molecule
Emp. Form.:
C23H24O6
Mol. Mass.:
396.4331
SMILES:
[#6]\[#6](-[#6])=[#6]\[#6]-c1c(-[#8])cc2oc3cc(-[#8])c(-[#8])c(-[#6]\[#6]=[#6](\[#6])-[#6])c3c(=O)c2c1-[#8]
: