Target
Lysine-specific demethylase 4E
Ligand
BDBM50122002
Substrate
Meas. Tech.
ChEMBL_1558375 (CHEMBL3772967)
IC50
1259±n/a nM
Citation
 Westaway, SMPreston, AGBarker, MDBrown, FBrown, JACampbell, MChung, CWDrewes, GEagle, RGarton, NGordon, LHaslam, CHayhow, TGHumphreys, PGJoberty, GKatso, RKruidenier, LLeveridge, MPemberton, MRioja, ISeal, GAShipley, TSingh, OSuckling, CJTaylor, JThomas, PWilson, DMLee, KPrinjha, RK Cell Penetrant Inhibitors of the KDM4 and KDM5 Families of Histone Lysine Demethylases. 2. Pyrido[3,4-d]pyrimidin-4(3H)-one Derivatives. J Med Chem 59:1370-87 (2016)  
Target
Name:
Lysine-specific demethylase 4E
Synonyms:
2-OG-Dependent Histone Demethylase JMJD2E Jumonji domain-containing protein 2E (JMJD2E) KDM4DL KDM4E_HUMAN Lysine-specific demethylase 4E | Lysine-specific demethylase 4E (KDM4E)
Type:
Enzyme
Mol. Mass.:
56815.71
Organism:
Homo sapiens (Human)
Description:
B2RXH2
Residue:
506
  
Inhibitor
Name:
BDBM50122002
Synonyms:
CHEMBL1383671
Type:
Small organic molecule
Emp. Form.:
C6H6N2O2
Mol. Mass.:
138.124
SMILES:
Nc1cnccc1C(O)=O
: