Target
cAMP-specific 3',5'-cyclic phosphodiesterase 4A
Ligand
BDBM50150243
Substrate
Meas. Tech.
ChEMBL_1556442 (CHEMBL3772473)
Ki
1200±n/a nM
Citation
 Li, PZheng, HZhao, JZhang, LYao, WZhu, HBeard, JDIda, KLane, WSnell, GSogabe, SHeyser, CJSnyder, GLHendrick, JPVanover, KEDavis, REWennogle, LP Discovery of Potent and Selective Inhibitors of Phosphodiesterase 1 for the Treatment of Cognitive Impairment Associated with Neurodegenerative and Neuropsychiatric Diseases. J Med Chem 59:1149-64 (2016)  
Target
Name:
cAMP-specific 3',5'-cyclic phosphodiesterase 4A
Synonyms:
3',5'-cyclic phosphodiesterase PDE46 PDE4A_HUMAN Phosphodiesterase 4A | Phosphodiesterase 4A (PDE4)
Type:
Enzyme
Mol. Mass.:
98113.27
Organism:
Homo sapiens (Human)
Description:
P27815
Residue:
886
  
Inhibitor
Name:
BDBM50150243
Synonyms:
CHEMBL3770467
Type:
Small organic molecule
Emp. Form.:
C28H31N7O
Mol. Mass.:
481.592
SMILES:
[H][C@@]12CCC[C@]1([H])N1C(=N2)N(C)C(=O)c2c(Nc3ccccc3)n(Cc3ccc(cc3)C3CCCN3)nc12
: