Target
Trypanothione synthetase
Ligand
BDBM50152094
Substrate
Meas. Tech.
ChEMBL_1565118 (CHEMBL3782440)
IC50
93±n/a nM
Citation
 Yamasaki, KTani, OTateishi, YTanabe, ENamatame, INiimi, TFurukawa, KSakashita, H An NMR Biochemical Assay for Fragment-Based Drug Discovery: Evaluation of an Inhibitor Activity on Spermidine Synthase of Trypanosoma cruzi. J Med Chem 59:2261-6 (2016)  
Target
Name:
Trypanothione synthetase
Synonyms:
TRS TryS | Trypanothione synthetase (TryS)
Type:
Enzyme
Mol. Mass.:
73442.57
Organism:
Trypanosoma cruzi
Description:
Q9GT49
Residue:
647
  
Inhibitor
Name:
BDBM50152094
Synonyms:
CHEMBL3780789
Type:
Small organic molecule
Emp. Form.:
C7H15N
Mol. Mass.:
113.2007
SMILES:
C[C@H]1CC[C@H](N)CC1
: