Target
Estrogen receptor
Ligand
BDBM50153696
Substrate
Meas. Tech.
ChEMBL_1561516 (CHEMBL3776153)
IC50
0.400000±n/a nM
Citation
 Scott, JSBailey, ADavies, RDDegorce, SLMacFaul, PAGingell, HMoss, TNorman, RAPink, JHRabow, AARoberts, BSmith, PD Tetrahydroisoquinoline Phenols: Selective Estrogen Receptor Downregulator Antagonists with Oral Bioavailability in Rat. ACS Med Chem Lett 7:94-9 (2016)  
Target
Name:
Estrogen receptor
Synonyms:
ER ESR ESR1_HUMAN Estrogen receptor Estrogen receptor (ER-alpha) Estrogen receptor alpha (ER) Nuclear receptor subfamily 3 group A member 1
Type:
Protein
Mol. Mass.:
66230.44
Organism:
Homo sapiens (Human)
Description:
P03372
Residue:
595
  
Inhibitor
Name:
BDBM50153696
Synonyms:
CHEMBL3774690
Type:
Small organic molecule
Emp. Form.:
C23H26FNO3
Mol. Mass.:
383.4558
SMILES:
C[C@H](CF)CN1[C@H](C)Cc2cc(O)ccc2[C@H]1c1ccc(\C=C\C(O)=O)cc1
: