Target
Estrogen receptor
Ligand
BDBM50153708
Substrate
Meas. Tech.
ChEMBL_1561513 (CHEMBL3776150)
IC50
0.960000±n/a nM
Citation
 Scott, JSBailey, ADavies, RDDegorce, SLMacFaul, PAGingell, HMoss, TNorman, RAPink, JHRabow, AARoberts, BSmith, PD Tetrahydroisoquinoline Phenols: Selective Estrogen Receptor Downregulator Antagonists with Oral Bioavailability in Rat. ACS Med Chem Lett 7:94-9 (2016)  
Target
Name:
Estrogen receptor
Synonyms:
ER ESR ESR1_HUMAN Estrogen receptor Estrogen receptor (ER-alpha) Estrogen receptor alpha (ER) Nuclear receptor subfamily 3 group A member 1
Type:
Protein
Mol. Mass.:
66230.44
Organism:
Homo sapiens (Human)
Description:
P03372
Residue:
595
  
Inhibitor
Name:
BDBM50153708
Synonyms:
CHEMBL3774777
Type:
Small organic molecule
Emp. Form.:
C25H20F3NO4
Mol. Mass.:
455.4258
SMILES:
OC(=O)\C=C\c1ccc(cc1)C1N(CCc2cc(O)ccc12)c1ccc(OC(F)(F)F)cc1
: