Target
Acetylcholinesterase
Ligand
BDBM26190
Substrate
Meas. Tech.
ChEMBL_1567405 (CHEMBL3790088)
Ki
1.2±n/a nM
Citation
 Özgeris, BGöksu, SPolat Köse, LGülçin, ISalmas, REDurdagi, STümer, FSupuran, CT Acetylcholinesterase and carbonic anhydrase inhibitory properties of novel urea and sulfamide derivatives incorporating dopaminergic 2-aminotetralin scaffolds. Bioorg Med Chem 24:2318-29 (2016)  
Target
Name:
Acetylcholinesterase
Synonyms:
ACES_ELEEL Acetylcholinesterase (EeAChE) | ache
Type:
Enzyme
Mol. Mass.:
71812.79
Organism:
Electrophorus electricus (Electric eel)
Description:
Residue:
633
  
Inhibitor
Name:
BDBM26190
Synonyms:
1,4-Dihydroxybenzene, XIII CHEMBL537 Hydroquinone, HQ phenol derivative, 4
Type:
Small organic molecule
Emp. Form.:
C6H6O2
Mol. Mass.:
110.1106
SMILES:
Oc1ccc(O)cc1
: