Target
Proteasome subunit beta type-5
Ligand
BDBM50160868
Substrate
Meas. Tech.
ChEMBL_1572440 (CHEMBL3796231)
IC50
1.6±n/a nM
Citation
 Lei, MFeng, HWang, CLi, HShi, JWang, JLiu, ZChen, SHu, SZhu, Y 3D-QSAR-aided design, synthesis, in vitro and in vivo evaluation of dipeptidyl boronic acid proteasome inhibitors and mechanism studies. Bioorg Med Chem 24:2576-88 (2016)  
Target
Name:
Proteasome subunit beta type-5
Synonyms:
20S proteasome chymotrypsin-like LMPX PSB5_HUMAN Proteasome Macropain subunit MB1 X
Type:
Protein
Mol. Mass.:
28480.96
Organism:
Homo sapiens (Human)
Description:
Residue:
263
  
Inhibitor
Name:
BDBM50160868
Synonyms:
CHEMBL499504
Type:
Small organic molecule
Emp. Form.:
C25H33BN2O4
Mol. Mass.:
436.352
SMILES:
CC(C)C[C@H](NC(=O)[C@H](Cc1ccccc1)NC(=O)c1cccc2CCCCc12)B(O)O
: